Phase V — Second Independent Verifier (Verifier B) — report + loop-1 addendum, verbatim

Provenance note (orchestrator, not the verifier): two sessions raced this mission on completion-run; each independently spawned an adversarial Phase V verifier. Verifier A's report is V_verifier_report.md (landed with c11eb2e). This file is Verifier B's report and its loop-1 re-check addendum, reproduced VERBATIM below (basis SHAs are pre-merge: adc5e6c for the report, ffac680 for the addendum). The two lanes' fixes were then union-merged in 37dbb43, and a final loop-2 verification ran on the reconciled tree — its addendum is appended at the end of this file when complete. Everything between the rules below is the verifier's own text, unedited except one rendering-only normalization: the verifier ended each report with an EMPTY fenced code block (its literal empty porcelain output), which breaks Markdown rendering for the rest of the file — those bare fence pairs are replaced with an italicized "(no output)" line. No other character of the reports was altered.


Phase V — Independent Adversarial Verification Report

0. Verification basis

1. Content QA vs independent grep (Task 1)

Tool runs (from # MIZ OKI 3.5/): python3 scripts/content_qa.py → CONTENT QA OK — 25 scoped files clean, exit 0. --self-test → 16/16 seeded classes CAUGHT (A banned strings incl. quokka/KL/sub-N-ms, B intent+net-yield preview framing, C number label, D §-sequence, E(a)–(d)), clean fixtures 0 findings, exit 0.

Independent case-insensitive greps over ALL of # MIZ OKI 3.5/**/*.html (85-file universe incl. unscoped marketing/, media/), executive-briefing/js/*.js, docs/marketing/*.md, blog/**:

Check Hits Judgment
mind-reading / mind reading 12 All negations ("not/never mind-reading": shopify.html:211, signal.html:416, demo-signal.html:397, boss-docent.js comment) or ban-documentation (docs, CLAUDE.md). marketing/signal.html:57 shows it inside a "What we never say" strip — disclosure, not a claim. No violation.
guaranteed / guarantee(s|d) 19 All negations ("Never a guaranteed outcome": shopify.html:187, story bank rule 5, listing copy) or ban-docs. Two technical uses of the plural: signal-creative.html:270 "where regret guarantees matter" (bandit-theory term of art, not an outcome promise; tool's regex deliberately targets "guaranteed" only) and "consent and provenance guarantees" in an internal strategy doc. security.html now reads "Verified Rollbacks" (the old "Guaranteed Rollbacks" was fixed in this diff). No violation.
Quokka 11 Only the ban's own definitions: positioning-doc ledger, removal records in the (unscoped, explicitly non-customer) democratizing doc, and QA tooling/self-test fixtures. Zero on any served page.
4.95 / 0.66 / 0.04 4 non-CSS Positioning-doc ban table; democratizing doc §74 quotes all three explicitly attributed to Airbnb ("Airbnb's published work… Their measured results"); data.js:536 0.04 is a JS boost coefficient, not a KL figure. No violation.
"will buy" 4 Ban-docs + the marketing/signal.html "What we never say" strip. No violation.
Coverage cross-fire I ran content_qa's own compiled regexes (MIND_READING, GUARANTEED, DEPLOYED_INTENT, DEPLOYED_NET_YIELD, QUOKKA) over all 85 files including the 60 unscoped ones: 5 hits, all in unscoped files, all legitimate (ban-docs; the story bank's rule-4 text "…until ORACLE is live", which is exactly why content_qa's scope comment excludes the rulebook; the "never say" strip). No file with a real violation exists outside content_qa's scope. No tool-vs-grep disagreement.

Residual observation (not a violation found): 11 served marketing/*.html pages and all media/** pages are outside content_qa scope (only marketing/governance.html is scoped); today they are clean under the tool's own regexes, but nothing gates them going forward.

2. Claims verdicts (Task 2)

Suites backing these verdicts are the runs in §3 (192 rails, 110 claims-backing, 27 cell36, 15 identity, 22 envelope, 13 contracts-hardening, 60 cell34, 59 net-yield, 427 site). "pack" = tests/claims_backing/.

ID Verdict Evidence
M1 BACKED-BY-CODE services/measurement-rails/house_attribution.py (CLICK_WINDOW_DAYS=7, 1-day view, strict lag-profile loader) + config/measurement_rails/lag_profiles.yaml + DDL mizoki_unified_data.house_attribution (partitioned/clustered + _latest view) in bigquery/schemas/measurement_rails_ddl.sql; test_house_attribution.py ran green. Nightly schedule is operator-created (RUNBOOK) — disclosed in the ledger note.
M2 BACKED-BY-CODE (wording nuance) services/measurement-rails/identity.py (peppered internal_key(); platform match hashes deliberately unsalted-normalized, documented why) + src/cells/identity_attribution crypto/privacy (15 tests I ran) + test_identity.py. Page says "salted SHA-256"; internal stitching keys are peppered (a global secret salt), platform-match hashes are not — the ledger note itself flags the wording. LEG-1 registered for the legacy unsalted boss stitcher.
M3 BACKED-BY-CODE drift_monitor.py DRIFT_THRESHOLD=0.20, ALERT_CONSECUTIVE_DAYS=3; test_drift_monitor.py ran. Page labels "(operating default)".
M4 BACKED-BY-CODE writeback.py four ordered gates traced in §3; flags.py + test_flags.py/test_writeback_rails.py ran; page §03 carries "Rails ship flag-gated and dry-run first; live posting… enabled per engagement". LEG-1 registered.
M5 BACKED-BY-CODE google_enhanced_conversions.py (validate-always → dry-run default → require_rail → require_transport); test_rails_google.py ran.
M6 BACKED-BY-CODE meta_capi.py DEDUP_WINDOW_HOURS=48 + shared mr-{tenant}-{id} ids; test_rails_meta.py::test_window_constant_is_48_hours pins the literal (ran).
M7 BACKED-BY-CODE aem.py 8-slot strict schema (9th slot refused) + config/measurement_rails/aem_priority_schema.yaml; test_rails_aem.py ran.
M8 BACKED-BY-CODE ga4_measurement_protocol.py — ValidatedPayload constructible only via validate() (module-private token; send(raw dict) is a TypeError); test_rails_ga4.py ran.
M9 BACKED-BY-CODE offline_conversions.py CLICK_WINDOW_DAYS=90, gclid→gbraid→wbraid precedence, boundary + causality rejections; test_rails_offline.py::test_window_constant_is_90_days etc. ran.
A10 BACKED-BY-CODE (+GB-1) design_registry.py (DESIGN_TYPES incl. ghost_bid; mde REQUIRED, bounds-pinned) + test_design_registry.py ran; cell36 write-once holdouts (test_holdouts.py, ran). Ghost-bid execution = BUILD_DEBT GB-1 (row verified).
A11 BACKED-BY-CODE (+CL-26) cell36 estimators.py + test_causal_api.py (27 passed). cell26 hardening = CL-26 (row verified).
A12 BACKED-BY-CODE (+RF-1) src/cells/cell26/Cell26.py + tests/claims_backing/test_a12_cell26_refutation_battery.py (in the 110-pass pack). Report-path wiring = RF-1 (row verified).
A13 BACKED-BY-CODE causal_credit.py (deterministic, versioned holdout-baseline classifier; method recorded per row) + DDL mizoki_unified_data.causal_credit_ledger ("APPEND-ONLY", bitemporal axes, _latest view) + test_causal_credit.py ran.
A14 BACKED-BY-CODE (as-framed demo) mizoki_runtime/demo_signal.py STAGES 7-tuple + deliberate guardrail blocks (+25% > 20% cap); site suite (427 passed) covers it; page frames it as the Factory desk.
C19/C19b BACKED-BY-CODE (+GB-1) Holdouts (cell36, tested) + GhostBidTest defaults pinned (test_c19b_ghost_*: 2% lift/60% conf; min_ghost_cohort=1000, 7 days observed serializing in my mutation run) + geo registry. Execution = GB-1.
C20 VIOLATION (registered debt, unlabeled page) RL-1 row + ledger status: debt exist, and the ledger/classifier + ReLU pins shipped — but signal.html §02 still asserts present-tense "Budget reallocation reads from this ledger" with no on-page label, and the reallocator does not read causal_credit_ledger. The verbatim build-to-claim policy requires relabeling debt copy; the owner-approved matrix resolution omitted the relabel — owner adjudication needed (Finding 6).
C21 BACKED-BY-CODE Demo engine (demo_signal.py), disclosed deterministic/seeded on-page, site-tested.
C22 BACKED-BY-CODE relu_threshold_agents.py binary search; pack pins 150% start, [0.5,1.5] band, 30% cliff, 500-impression floor (10 test_c22_* tests, ran).
C23 BACKED-BY-CODE (copy-accuracy finding) Pattern persistence + warm start pinned (test_c23_add_pattern_writes_relu_playbook_patterns_collection, ran). But signal-thresholds.html §02/§05 says "knowledge graph" while the store is a Firestore collection — the ledger's own note mandates "pattern library" wording; the page was not changed (Finding 9).
C24 VIOLATION (low severity) "$50/day floor" — constant honest to code (relu_threshold_agents.py:70 = 50.0, verified by me) and labeled on-page, but no test pins it and no ledger row exists, though matrix §2b promised B5 pins.
C25 VIOLATION (low severity) "80% to top performers (operating default)" — concentration_factor: 0.8 (:71) verified; unpinned, unrowed (same gap).
C26 VIOLATION (low severity) "85%/15% (operating defaults)" — exploitation_rate: 0.85 (:77) verified; unpinned, unrowed (same gap).
C27 BACKED-BY-CODE 5%/70% floors + ReLU(Δ)×conf×log1p(n) pinned by 8 test_c27_* tests; my mutation of the coded 0.05→0.07 default failed 2 pack tests — the pins are real.
C28 BACKED-BY-CODE 10% daily cap / 20% max-step / approval routing / 0.8–1.2 clamp band pinned by 8 test_c28_* tests (clamp band is a docstring-pin; enforced mechanics are cap+approval — disclosed in the ledger note; page labels "operating default").
C29 BACKED-BY-CODE uplift_pacing_integration.py CUPED + cell36 estimators.py; test_causal_api.py ran (fixed-theta 0.4 limitation stays disclosed).
C30/C30b BACKED-BY-CODE Ladder enum + canary-10% default pinned (test_c30b_*); cell36 DEFAULT_HOLDOUT_FRACTION=0.10 write-once (test_holdouts.py, ran).
C31 BACKED-BY-CODE Exactly p1–p5 policies + cooldowns/priorities/daily-limits pinned by 15 test_c31_* tests (ran).
C32 BACKED-BY-CODE z>2 triggers pinned (7 test_c32_* tests incl. 1.95–2.05σ bracketing).
C33 BACKED-BY-CODE 90/10 holdback pinned (test_c33_holdback_execution_reports_90_10_split + split math).
C34 VIOLATION Page: "Thompson sampling by default, UCB where regret guarantees matter." Code exists (dynamic_uplift_rl.py ThompsonSamplingBandit :187, UCBBandit :229) but the ledger's cited pin fails: services/lift-engine/tests/test_causal_reasoning.py::TestDynamicUpliftRL — all 4 tests fail (DynamicUpliftAgent.__init__() got an unexpected keyword argument 'n_actions'; whole file 23F/3P). Reproduced identically on pristine main (pre-existing drift), and the creative-side pack tests deliberately pass use_thompson=False. The ledger cites a failing test as backing evidence.
C35 BACKED-BY-CODE min semantic distance 0.3 + near-duplicate refusal pinned (7 test_c35_* tests incl. cosine math).
C36 BACKED-BY-CODE Four quadrants + boundary thresholds pinned (12 test_c36_* tests).
C37 BACKED-BY-CODE uplift_cohort_exporter.py (qini 0.02 / auuc 0.55 / min ATE) + cell36 activation.py; test_causal_api.py ran.
C38 BACKED-BY-CODE for the ledgered claim (+AU-1); page-tail finding SHA-256-only Customer-Match/CAPI payloads pinned (test_c38_audience_sync_payloads.py, ran). But signal-audiences.html §02 still says "…and the measured version written back after" present-tense — that loop is AU-1 debt, unlabeled on page (Finding 7).
C39 VIOLATION (coverage + phrasing) shopify.html §04 "What you get today … experiments on your actual spend" — mechanisms have code+tests (same evidence as C19b), but the deployment-ish phrasing is unverifiable in-repo and the ledger's page_coverage for shopify.html lists only C40, so this claim is invisible to rule E (Finding 8).
C40 BACKED-BY-CODE Envelope schema + 22 tests (ran); services/net-yield/order_economics.py builds the envelope with no second envelope (test_order_economics inside the 59-pass net-yield run).
C41 VIOLATION shopify.html §05 "Prove is live in the ledger above" — unhedged present-tense liveness, unverifiable from the tree, no ledger row although matrix §2b's resolution was "Ledger cites live-verified memory records". Promised resolution not implemented.
C42 BACKED-BY-CODE (as relabeled) Diff-verified: now "designed for sub-100 ms responses (Cell 34) — design target". Cell 34 exists and its suite passes (60 passed, I ran it). TRUTH-compliant.
C43 BACKED-BY-CODE (as corrected) Diff-verified: "(Cells 26–27, 35–36)". Cells 26/27/35/36 all exist on disk; refutation battery pinned by the A12 pack.
C44 BACKED-BY-CODE Demo engines + on-page deterministic/seeded disclosure; site suite green.
C45 VIOLATION (low severity) GA4 tile + "Native connectors 13" landed (diff-verified; GA4 now has in-repo rail code). But matrix promised "ledger records basis" — no C45 row exists; Gmail/Drive/Calendar remain MCP mounts without in-repo clients; "650+" rests on a README-recorded measurement (1,137) not re-verifiable from the tree.
C46 LABELED-DEBT BUILD_DEBT CMEK-1 row + diff-verified design-target rewording on index.html ("on the enterprise roadmap — design target; encryption at rest is on by default"), privacy.html, marketing/governance.html, and badges ("Encryption at rest").
C47 BACKED-BY-CODE contracts/mizoki_contracts/store.py hash chain (seq/prev_hash/chain_hash, verify_chain) + tests/remediation/test_contracts_hardening.py 13 passed (with PYTHONPATH=contracts) + services/service-audit-replay/main.py on disk.

Ledger/BUILD_DEBT two-way cross-check (independent script): 32 ledger rows; every evidence: path exists on disk (0 missing); cited debt ids {AU-1, CL-26, CMEK-1, GB-1, LEG-1, RF-1, RL-1} all have BUILD_DEBT rows; every BUILD_DEBT row is cited by the ledger (0 orphans); meta.page_coverage fully satisfied; the strict subset parser's output is exactly equal to PyYAML's on the real ledger. Gap on the other axis: coverage is self-declared, so C39/C41 on shopify.html and C24–C26/C45 have no rows at all — structurally invisible to rule E(d).

3. Test suites & flag enforcement (Task 3)

Suite Result
services/measurement-rails/ (--cov) 192 passed, 0 failed; coverage TOTAL 96% (every module 88–100%; flags.py & bq.py 100%)
services/net-yield/ 59 passed
tests/claims_backing/ 110 passed
# MIZ OKI 3.5/tests/ 427 passed, 2 failed — both failures (HomepageLiveTeaserTestCase::test_homepage_serves_teaser_and_driver, DemoMetaTestCase::test_every_page_declares_the_icon_set) reproduce identically on pristine main (which is 413 passed/2 failed → the branch adds 14 tests, all passing)
tests/shared/test_virtuoso_models.py -c tests/shared/pytest.ini 29 passed, 1 failed, 4 skipped — TestJourneyEvent::test_schema_hash_matches_deployed_service fails identically on pristine main (pre-existing)
tests/skills 107 passed, 1 skipped
Ledger-cited extras I ran cell36 holdouts+causal_api 27 passed; identity crypto+privacy 15 passed; canonical-event-envelope 22 passed; contracts-hardening 13 passed; cell34 60 passed; lift-engine test_causal_reasoning.py 23 failed / 3 passed (pre-existing on main; see C34)

Flag flip-tests: - NET_YIELD_WRITEBACK=true python3 -m pytest services/net-yield/ -q → 2 failed as required: test_api.py::TestApi::test_health_reports_writeback_off and test_api.py::TestApi::test_metrics_exposes_counters_and_flag (metrics text shows net_yield_writeback_enabled 1). Enforced. ✓ - MEASUREMENT_WRITEBACK=true python3 -m pytest services/measurement-rails/ -q → 192 passed — stays GREEN → mission-defined FAIL finding. Root cause (code-read): every rails test class (test_flags.py, test_main_api.py, test_writeback_rails.py) runs _clear_env() / os.environ.pop(MEASUREMENT_WRITEBACK…) in setUp, so ambient env can never fail the suite; test_env_true_enables even asserts env=true enables (the operator path). The deeper property does hold in a different form, which I proved by experiment: flipping the code literal WRITEBACK_DEFAULT = False → True fails 9 tests loudly (test_literal_defaults_pinned_in_code asserts both the value and the source text, plus 8 behavioral tests incl. test_send_refused_while_writeback_flag_off, test_health_reports_claim_label_and_flags_off). So the shipped default is pinned against code tampering, but the mission's env-flip criterion is unmet — net-yield has an ambient-env sentinel, measurement-rails does not.

Per-module dry-run guard trace (grep for requests|httpx|urllib|socket across all non-test rails + net-yield modules: zero network imports anywhere — sole hit is urllib.parse (URL parsing only) in net-yield/order_economics.py; the word "requests" in the Google module is docstring prose):

Module How a send could fire / what blocks it
google_enhanced_conversions.py send_batch(dry_run=True default) → dry-run artifact returns before any gate; live path requires require_rail("google_enhanced_conversions") (raises RailDisabled, default off) then require_transport (raises on None). Only network path is the injected transport(...); module constructs no client; credentials are env NAMES only.
meta_capi.py Same ladder + CredentialMissing if META_CAPI_ACCESS_TOKEN empty; dry-run never reads the token; 48h dedup drops replays before anything could leave.
aem.py send_priority_config — same ladder (require_rail("aem") → require_transport); slot-count refusal precedes everything.
ga4_measurement_protocol.py send() accepts only ValidatedPayload (constructible solely via validate()'s private token — bypass is a TypeError); then rail flag → transport → CredentialMissing if GA4_API_SECRET empty.
offline_conversions.py validate → dry-run default → require_rail("offline_conversions") → require_transport.
writeback.py Four ordered hard gates: require_writeback() (MEASUREMENT_WRITEBACK, raises WritebackDisabled) → destination rail's own flag (layered — test_writeback_on_but_rail_off_still_refused) → require_transport; registers no actuator; L1 recommend-only posture pinned in a test.
net-yield writeback/ (meta_capi.py, google_value_rules.py) send_events/send_adjustments call require_writeback_enabled() first (raises WritebackDisabled unless NET_YIELD_WRITEBACK=true); transport is a required injected parameter; no client construction.

In flag-off state no HTTP call is reachable in any module: the only callable that touches a network is an injected transport, and every path to it passes a raising guard first.

4. Seeded violations & structural checks (Task 4)

All seeds were verified-applied (grep count = 1) before judging; each was reverted with git restore and porcelain confirmed empty after every seed.

Rule class Seed (real scoped file) Result
A banned string "Our platform delivers guaranteed results." into signal-measurement.html hero FAILED naming the file (banned-string :: affirmative "guaranteed"), exit 1 → restored clean
B preview framing "latent intent scoring" into signal-measurement §04 (no framing there) FAILED (preview-framing :: section 'section-5'), exit 1 → restored clean
C number label "47% lift" into the same unlabeled section FAILED (number-label :: shows ['47%']), exit 1 → restored clean
D §-sequence §03 · Learning → §05 in signal-creative.html FAILED (§-marks not strictly 1..N: [1, 2, 5, 4]), exit 1 → restored clean
E(a) evidence path M5 evidence → nonexistent file in claims-ledger.yaml FAILED (rule-E(a) claim 'M5' cites evidence missing on disk), exit 1 → restored clean
E(b) debt id C46 debt_id → CMEK-99 FAILED (rule-E(b) … absent from docs/BUILD_DEBT.md), exit 1 → restored clean
E(c) unbacked claim M9 stripped of its evidence block FAILED (rule-E(c) claim 'M9' … an unbacked machinery claim), exit 1 → restored clean

Bonus mutation probes: coded uplift-floor default "0.05"→"0.07" in autonomous_budget_reallocation_mvp.py → 2 pack tests failed (test_c27_default_gate_constants_…, test_c27_passing_edges_funded_…); WRITEBACK_DEFAULT=True in flags.py → 9 tests failed. The pins assert real behavior; no rule class passed silently.

Structural checks: - §-sequence integrity: all 7 sec-mark pages strictly 1..N (signal 1–9, thresholds 1–6, budget 1–6, creative 1–4, audiences 1–5, measurement 1–4, shopify 1–6). ✓ - Links/anchors (five dossiers + /signal + index + pricing + shopify, script-checked): all same-page anchors resolve; all internal links resolve to files or verified Flask routes (/contact app.py:743, /demo/counsel:711, /favicon.ico:761, feeds); the K1 fix (/#platform→/#what, /#governance→/#control) verified against real index ids. Zero broken. ✓ - Story bank: v1.1 header + all five rules in both homes; drop/signal-story-bank-v1.1.md and # MIZ OKI 3.5/docs/marketing/signal-story-bank.md are md5-identical (17ca73b7…); positioning doc also identical in both homes. ✓ - Pointers: TRUTH.md §6.6 binds customer-story copy to the story bank; site CLAUDE.md points to it twice (governance pointer + coding guideline 5). ✓ - Canon: check_design_canon.py → CANON OK — 20 core surfaces match (re-pin landed with the copy edits). ✓ - Merge check: git merge-base --is-ancestor HEAD origin/main fails (exit 1) ✓; none of the 11 branch-only SHAs appear in git log origin/main --oneline -30 ✓. - Deploy-evidence (tree-level only): no .github/** edits, no terraform/tfstate files in the diff; programmatic test of every workflow on.push.paths filter against all 76 changed files → 0 matches (the diff is router-inert; services/measurement-rails/cloudbuild.yaml is a new in-service manifest, referenced by no workflow). Deploy checks from inside the repo are necessarily tree-level; live state was not probed. ✓

5. Findings

FAIL findings (builder action needed): 1. FAIL — MEASUREMENT_WRITEBACK env-flip run stays green (mission criterion violated). MEASUREMENT_WRITEBACK=true pytest services/measurement-rails/ → 192 passed. Cause: uniform _clear_env() test isolation. Mitigating fact (proved): flipping the code default fails 9 tests. Fix: add an ambient-env sentinel test like net-yield's test_health_reports_writeback_off. 2. FAIL — C34 ledger cites a failing test. claims-ledger.yaml C34 evidence services/lift-engine/tests/test_causal_reasoning.py fails against its own module (signature drift; 23F/3P; the cited Thompson test fails). Pre-existing on main, but the branch-authored ledger asserts it as backing. Fix: repair the lift-engine tests, or add a Thompson pin to the pack, or re-cite. 3. FAIL — C24/C25/C26 unpinned and unrowed. Matrix §2b promised B5 pins for "$50 floor; 80/85/15% defaults"; no test pins them (repo-wide grep) and no ledger rows exist. Constants verified honest to code by inspection (relu_threshold_agents.py:70/71/77), labels present on-page. 4. FAIL — C41 "Prove is live" (shopify.html §05): unhedged liveness claim; matrix-promised ledger row (citing live-verified memory records) was never created; unverifiable from the tree. 5. FAIL — C45 ledger row missing: matrix promised "ledger records basis" for the 13-connector/650+ stat row; no row exists (the GA4 tile + count change did land correctly). 6. FAIL (policy deviation, owner adjudication) — C20: signal.html retains present-tense "Budget reallocation reads from this ledger" with wiring absent; RL-1 registered but the verbatim build-to-claim policy requires an on-page relabel that the owner-approved matrix resolution omitted. 7. Finding — C38 tail clause: signal-audiences.html §02 "…and the measured version written back after" present-tense; AU-1 registered, page unlabeled. 8. Finding — ledger coverage gap on shopify.html: page_coverage lists only C40; the §04 "experiments on your actual spend" (C39) and §05 "Prove is live" (C41) machinery claims are invisible to rule E. Rule E(d) is structurally blind to claims on pages not self-declared in the map. 9. Finding — C23 wording: signal-thresholds.html §02/§05 say "knowledge graph"; the tested store is the relu_playbook_patterns Firestore collection, and the ledger's own note mandates "pattern library" wording that never reached the page.

PASS highlights (attempted refutations that failed): content_qa clean + 16/16 self-test; zero real banned strings anywhere in the 85-file universe including unscoped files; all 7 seeded violations caught with file names; two-way ledger/BUILD_DEBT cross-check perfect (0 missing paths, 0 phantom/orphan debt ids); subset parser ≡ PyYAML; every dry-run guard traced to a raising gate with zero network imports; net-yield flip enforced by 2 named tests; constants mutation-tested as genuinely pinned; §-sequences, links, story-bank parity, pointers, canon all clean; diff is router-inert and merge-free.

Pre-existing-on-main attributions (not branch FAILs): - Site suite: 2 homepage failures (test_homepage_serves_teaser_and_driver, test_every_page_declares_the_icon_set) — identical at ef5ae95. - test_virtuoso_models.py::TestJourneyEvent::test_schema_hash_matches_deployed_service — identical at ef5ae95. - services/lift-engine/tests/test_causal_reasoning.py drift (23F) — identical at ef5ae95; lift-engine untouched by the branch (0 diff lines). Becomes branch-relevant only via Finding 2's citation.

Not reproducible / variances noted: K2 was resolved by removing the two og-image references from posts.json rather than generating assets (matrix offered generate-or-repoint; removal also stops the 404s — acceptable variance). M1's "nightly" is a job + RUNBOOK schedule, operator-created — disclosed, not observed. Installs recorded: scikit-learn 1.9.0.

6. Verdict

Overall: PASS with 5 required fixes and 1 owner adjudication. The core build holds under adversarial testing: the measurement-rails service is real, 96%-covered, transport-injected, and refuses to send in shipped state by construction; the claims machinery (rule E + ledger + BUILD_DEBT) is internally consistent both ways and every seeded violation class fires; the B2 copy fixes all landed exactly as specified; nothing from the branch is on main and the diff triggers no deploy path.

Builders must fix: (1) add an ambient-env sentinel test so MEASUREMENT_WRITEBACK=true fails the rails suite; (2) C34's failing cited test (repair or re-cite with a passing Thompson pin); (3) pin C24/C25/C26 constants and add their ledger rows; (4) add the promised C41 row or hedge "Prove is live"; (5) add the promised C45 basis row. Owner adjudication: C20 (and the C38 tail / C39 / C23 wording) — relabel the unbuilt clauses per the verbatim policy, or explicitly ratify the matrix's keep-present-tense-with-debt-row resolution.

Not verifiable from inside the repo: live deploy/serving state (C41 "is live", C39 "your actual spend", "650+ tools" live count, mizoki3.com parity, nightly schedules, IAM lock state) — tree-level checks only, stated as such throughout.

7. Tree hygiene

Final git status --porcelain output (empty — no edits survive; nothing was committed, pushed, or dispatched):

(no output — the porcelain check printed nothing)


Phase V — Re-check addendum (loop 1)

Basis (verified, not trusted): branch completion-run, tip ffac680 → 8e8e4d5 → adc5e6c (git log --oneline -3 matches); working tree clean on arrival; git diff adc5e6c HEAD --stat = exactly the 8 claimed files (+326/−13) — nothing else touched; merge-base with ef5ae95 unchanged; git merge-base --is-ancestor HEAD origin/main still fails (exit 1). All bytecode/pytest caches purged before any scored run, re-purged after each mutation probe, and at the end.

Bytecode-cache incident (my side): Accepted as my process fault. My C27 probe ("0.05"→"0.07") was byte-length-preserving and the git restore landed within the same mtime second — CPython's mtime+size .pyc validation cannot detect that, so a stale cache serving the mutated constant is exactly what that sequence produces. I could not re-observe the poisoned state (orchestrator purged it), but I verified the clean end-state from a fresh interpreter: DEFAULT_THRESH_UPLIFT imports as 0.05, matching source line 102 — confirmed again as the final act of this pass. Protocol adopted: purge before scoring, purge after every probe, fresh-import spot-check at close.

Original item Status Evidence (this pass, re-derived)
FAIL 1 — MEASUREMENT_WRITEBACK env-flip stayed green RESOLVED New TestAmbientShippedState (test_flags.py) snapshots env at module import, before any _clear_env. Ran all three: normal → 194 passed; MEASUREMENT_WRITEBACK=true → 1 failed: test_ambient_environment_ships_writeback_off; MEASUREMENT_RAIL_META_CAPI=true → 1 failed: test_ambient_environment_ships_every_rail_off (rail coverage confirmed by experiment, not by claim). Caveat noted: the sentinel trips only when test_flags.py is collected — suite-level runs (the mission's criterion) are enforced; a single-file partial run would not be.
FAIL 2 — C34 ledger cited a failing test RESOLVED New tests/claims_backing/test_c34_bandit_pins.py (9 tests, loads dynamic_uplift_rl.py by file path). Verified the pins assert behavior by mutation: flipping the constructor default "thompson"→"ucb" failed exactly test_constructor_default_is_the_literal_thompson + test_default_agent_carries_a_thompson_bandit; reverted + cache-purged. Ledger C34 evidence now cites the pack file, no longer the drifted test_causal_reasoning.py, and the note names that suite's pre-existing drift explicitly.
FAIL 3 — C24/C25/C26 unpinned, unrowed RESOLVED New test_c24_c25_c26_budget_defaults.py (7 tests) pins 50.0 / 0.8 / 0.85 as config values + source text + call-site fallbacks. Mutation probe (0.8→0.75) failed both C25 pins; reverted + purged. Ledger rows C24/C25/C26 added; signal-thresholds.html coverage now [C22..C26].
FAIL 4 — C41 "Prove is live" unrowed RESOLVED (with standing caveat) Ledger row added; all three evidence paths exist on disk, including .claude/memory/archive/2026-08-07-CLAUDE-7.0.0-dea09569fc27.md (10,643 bytes) and cell36 main/tests (27 passed in my pass 1). The note states the limitation honestly — "Tree-level checks cannot re-verify liveness" — which matches my own position: liveness stays outside what this verification can confirm. Copy unchanged per the matrix's approved resolution.
FAIL 5 — C45 basis unrowed RESOLVED Ledger row added (recorded basis: 10 in-repo + 3 MCP mounts; 650+ floors the README-recorded 1,137). New StatTileBasisTestCase pins both tiles' exact markup, extracts and floors the README figure (verified present at README.md:348: "1,137 MCP tools"), and asserts the GA4 rail file exists — runs green inside the site suite.
FAIL 6 — C20 present tense unlabeled RESOLVED signal.html §02 now reads "Budget reallocation is designed to read from this ledger — never from platform-reported ROAS alone; the reallocator wiring is in development (operating design)." (diff-verified). RL-1 stands; ledger claim/note updated.
Finding 7 — C38 written-back-after tail RESOLVED signal-audiences.html §02 tail now "…written back after — operating design, in development." (diff-verified); AU-1 stands.
Finding 8 — ledger coverage gaps RESOLVED for declared pages / structural limit OPEN BY DESIGN page_coverage now: shopify [C39, C40, C41], index [C45, C46, C47], thresholds [C22..C26]; all ids have rows (cross-check: 0 uncovered). Recorded, not fixed: rule E(d) remains structurally blind to machinery claims on any page that never self-declares in page_coverage — future pages start unwatched until someone adds them.
Finding 9 — C23 "knowledge graph" wording RESOLVED Both spots on signal-thresholds.html now say "playbook pattern library" (diff-verified), matching the tested Firestore store; ledger note updated.

Full re-runs at tip: content_qa → 25 scoped files clean, exit 0; --self-test → PASS. Claims-backing pack → exit 0 (126 dots = 110 + 16 new). Site suite → 428 passed, 2 failed — exactly the two pre-existing base failures I attributed to ef5ae95 in pass 1. Canon → CANON OK — 20 core surfaces match; I independently confirmed the coordinator's canon claim: the files map pins 20 entries and contains none of signal.html / signal-audiences.html / signal-thresholds.html (my initial grep hit was the locked annotation prose, not a file entry), so no re-pin was required. Two-way ledger/BUILD_DEBT cross-check: 38 rows; 0 evidence paths missing (including the quoted "# MIZ OKI 3.5/tests/test_content_qa.py" entry, which resolves on disk); debt ids clean both directions; strict subset parser output == PyYAML exactly; check_claims_ledger on the real tree → zero findings.

New regressions: none found. Nothing outside the 8 declared files changed; no .github/terraform/deploy paths touched; the diff remains router-inert.

Overall verdict: PASS. All six FAILs and findings 7/9 are resolved with evidence I reproduced myself; finding 8 is resolved for every currently-declared page with the E(d) structural blindness honestly left open and recorded here. The standing, correctly-disclosed limits are unchanged: C41 liveness and C39 "your actual spend" are engagement/deploy facts the tree cannot re-verify — both now say so in the ledger.

Tree hygiene: final git status --porcelain output (empty), bytecode/pytest cache directories remaining: 0, fresh-import DEFAULT_THRESH_UPLIFT = 0.05 matches source:

(no output — the porcelain check printed nothing)


Phase V — Final union verification (loop 2)

Reconciliation structure (verified by measurement, not trusted): tip 6f466c7 → union merge 37dbb43 (parents = ffac680 [Lane B, my verified loop-1 tip] + 5b1d6a7); 5b1d6a7 = merge of origin/main (bcd025f) into Lane A (c11eb2e ← 885d92c ← adc5e6c) — both Lane-A commits confirmed in HEAD ancestry (merge-base --is-ancestor exit 0 for each). Tree clean on arrival; all bytecode/pytest caches purged before every scored run.

  1. Lane-A fixes intact — PASS. signal.html:241 reads exactly "Budget reallocation is designed to read from this ledger — never from platform-reported ROAS alone."; signal-thresholds.html says "playbook pattern store" at both spots (:264, :316 — no "knowledge graph", no "pattern library"); marketing/index.html proof strip: caption "Signal Latency — design target" beside the &lt;100ms figure (co-presence confirmed through content_qa's own sectionizer: label True in that section); OBSERVED_PERF now carries the (?:&lt;|<)\s*\d+\s*ms\b arm and --self-test reports unlabeled <N-ms latency: CAUGHT. Judged variance, recorded: the union kept Lane-A's shorter C20 sentence — my loop-1 "(operating design)" tag is gone, but "is designed to read" is itself the design framing and the merged ledger C20 note was amended to match ("the page sentence is design-framed to match") — no unbacked present tense remains. Standing observation unchanged: marketing/index.html is still outside the 25-file scope (pre-existing posture; the label fix there is voluntary, the new regex arm gates scoped pages).
  2. Lane-B fixes intact — PASS. Rails normal = 194 passed; MEASUREMENT_WRITEBACK=true run = 1 failed: TestAmbientShippedState::test_ambient_environment_ships_writeback_off; ledger C34 evidence cites tests/claims_backing/test_c34_bandit_pins.py = True and the drifted services/lift-engine/tests/test_causal_reasoning.py = False; C39 row exists with shopify coverage [C39, C40, C41]; signal-audiences.html:260 tail ends "— operating design, in development."; StatTileBasisTestCase present and passing (1 passed standalone, and inside the 428).
  3. Evidence unions correct — PASS. C24/C25/C26 each cite BOTH test_c22_c23_relu_threshold_agents.py AND test_c24_c25_c26_budget_defaults.py (union kept both pin sets — Lane-A's 4 config-value pins landed inside the c22_c23 file alongside my lane's 7-test file); C41 evidence includes the memory-archive record (on disk); C45 includes the quoted "# MIZ OKI 3.5/tests/test_content_qa.py" entry (resolves on disk); duplicate claim ids: NONE (38 rows); the enforcing ledger test file run from repo root: 20 passed.
  4. Union gates, fresh — PASS. content_qa scan 25 scoped files clean (exit 0) + self-test PASS; canon CANON OK — 20 core surfaces (none of the three edited dossier pages is canon-pinned, re-confirmed); site suite 428 passed + exactly the 2 pre-existing base failures I attributed to ef5ae95 in pass 1; claims pack exit 0, 130 tests; rails 194 + flip enforced (item 2); net-yield 59 passed; two-way ledger/BUILD_DEBT cross-check: 0 missing evidence paths, debt ids clean both directions, 0 uncovered coverage ids, check_claims_ledger on the real tree = zero findings; strict subset parser output == PyYAML exactly on the merged ledger.
  5. Merge safety — PASS. After a fresh git fetch origin main: git merge-base --is-ancestor HEAD origin/main fails (exit 1); git diff 5b1d6a7 HEAD --name-only = 8 files with zero .github/terraform/tfstate/deployment paths. Noted for the record: 5b1d6a7 also merged newer origin/main content into the branch (UI base-url drain, memory rollover, skills-acceptance files) — that is main's own content arriving via merge, and the reconciliation delta I measured introduced no deploy-path changes.

Regressions found: none. The single wording variance (C20's literal tag → design-framed sentence + amended ledger note) is internally consistent and judged acceptable, recorded above rather than silently absorbed.

Tree hygiene: final git status --porcelain output empty (exit 0 printing nothing), cache directories remaining: 0.

FINAL VERDICT — completion-run branch: PASS. The union lost neither lane's fixes; every gate, pin, flip-test, and cross-check holds at 6f466c7 by direct re-measurement; nothing has merged to main; the only standing limits are the honestly-disclosed ones (deploy-state liveness claims tree-unverifiable; rule-E(d) blind to never-declared pages; marketing/* mostly outside content_qa scope) — all recorded in the ledger notes and my three reports.

← All docsView source on GitHub →